neural auditory frequency analysis
definition: Speech, music, and every other sound one hears can be described by the pattern of amplitude at different frequencies. This pattern, which is called the sound's spectrum, distinguishes one sound from others. [Source: Encyclopedia of Perception; Auditory Frequency Analysis, Neural]
broader: audition
type: Concept

audition
type: Concept
narrower: neural auditory frequency analysis

methods
type: Collection
type: ConceptGroup
member: neural auditory frequency analysis