physiological processes
type: Concept
narrower: neural representation/coding

concepts
type: Collection
type: ConceptGroup
member: neural representation/coding

neural representation/coding
definition: The activity of neurons ultimately relates to the world outside the nervous system. The perceptions, planned actions, and beliefs of an animal throughout its life are reflected in this neural code. [Source: Encyclopedia of Perception; Neural Representation/Coding]
broader: physiological processes
type: Concept