aging and the brain
type: Concept
narrower: neurological disorders

concepts
type: Collection
type: ConceptGroup
member: neurological disorders

neurological disorders
definition: A number of disorders affect primarily the peripheral neurological system of older adults. These include Parkinson's disease (PD), tardive dyskinesia (TD), spinocerebellar ataxias (SA), amyotropic lateral sclerosis (ALS), and progressive supranuclear palsy (PSP). [Source: Encyclopedia of Health & Aging; Neurological Disorders]
broader: aging and the brain
type: Concept