liberal theory
type: Concept
narrower: new liberalism

concepts
type: Collection
type: ConceptGroup
member: new liberalism

new liberalism
definition: New liberalism refers to a body of distinctive legislation on social welfare enacted between 1906 and the outbreak of World War I. Herbert Samuel, Winston Churchill, and David Lloyd George were three of the government members most directly involved. The expression, however, was in use already. [Source: Encyclopedia of Political Theory; New Liberalism]
broader: liberal theory
type: Concept