nonfinancial information reporting
definition: The complexity of modernbusiness requires a company to disclose various information, formatted in numerous reports. Financial reporting traditionally has been regarded as the backbone of business reporting, which was more or less enough when an enterprise was primarily, if not exclusively, assessed on its crude financial performance. [Source: Encyclopedia of Business in Today's World; Nonfinancial Information Reporting]
broader: international accounting
type: Concept

concepts
type: Collection
type: ConceptGroup
member: nonfinancial information reporting

international accounting
type: Concept
narrower: nonfinancial information reporting