objectivity and diversity
definition: Increasing diversity in research institutions as well as in their surrounding societies is beginning to transform the very standards for good work and thus for what should count as desirable scientific achievements. The ideal of objectivity is the focus of this entry. [Source: Encyclopedia of Diversity in Education; Objectivity and Diversity]
broader: race, ethnicity and education
type: Concept

race, ethnicity and education
type: Concept
narrower: objectivity and diversity

concepts
type: Collection
type: ConceptGroup
member: objectivity and diversity