occupational carcinogens
definition: Occupational carcinogens remain one of the key causes of cancer in the United States. According to the National Institute for Occupational Safety and Health (NIOSH), exposure to carcinogens on the job accounts for 20,000 deaths and 40,000 new cancer cases each year in the United States. [Source: Encyclopedia of White-Collar and Corporate Crime; Occupational Carcinogens]
broader: work-related crimes
type: Concept

concepts
type: Collection
type: ConceptGroup
member: occupational carcinogens

work-related crimes
type: Concept
narrower: occupational carcinogens