concepts
type: Collection
type: ConceptGroup
member: occurrence coverage

legal and regulatory issues
type: Concept
narrower: occurrence coverage

occurrence coverage
definition: There are two basic types of medical liability insurance coverage: occurrence and claims made. Occurrence policies cover all claims that arise from events that take place during a specific policy period, irrespective of when the claims are reported to the insurance company. [Source: Encyclopedia of Health Care Management; Occurrence Coverage]
broader: legal and regulatory issues
type: Concept