concepts
type: Collection
type: ConceptGroup
member: ocean ranger disaster

work-related crimes
type: Concept
narrower: ocean ranger disaster

ocean ranger disaster
definition: The Ocean Ranger was a semisubmersible offshore drilling platform that sank off the coast of Newfoundland and Labrador during a storm on February 15, 1982. All 84 crew members died. [Source: Encyclopedia of White-Collar and Corporate Crime; Ocean Ranger Disaster]
broader: work-related crimes
type: Concept