concepts
type: Collection
type: ConceptGroup
member: odontology

odontology
definition: Forensic dentistry, or forensic odontology, is a recognized forensic science that involves the application of dental science in the collection, analysis, and evaluation of physical and biological dental evidence. It is common for court-qualified forensic odontologists to testify in criminal and civil proceedings. [Source: Encyclopedia of Crime and Punishment; Odontology]
broader: forensics
type: Concept

forensics
type: Concept
narrower: odontology