older adulthood
definition: In 2003, 12.4% of the U.S. population was 65 years or older, 14,888,185 were men, and 20,990,487 were women. Understanding the impact of age-related changes on individuals becomes important as more and more live to old age. [Source: Encyclopedia of Human Development; Older Adulthood]
broader: aging and older development
type: Concept

aging and older development
type: Concept
narrower: older adulthood

concepts
type: Collection
type: ConceptGroup
member: older adulthood