open coding
definition: Open coding refers to the initial phase of the coding process in the grounded theory approach to qualitative research (generating theory from data) espoused by Anslem Strauss and Juliet Corbin. They call this initial stage of data analysis open coding because they view the process as the “opening up” of the text in order to uncover ideas and meanings it holds. [Source: The SAGE Encyclopedia of Qualitative Research Methods; Open Coding]
broader: coding
type: Concept

coding
type: Concept
narrower: open coding

methods
type: Collection
type: ConceptGroup
member: open coding