open source networks
definition: Open source, or the open source movement, refers to ideas and actions advocating that the source materials used to create and develop a product—their source code—should be open so that any user has access to it. Open source can be seen as both a method of production and a political vision. [Source: Encyclopedia of Social Networks; Open Source Networks]
broader: technology and social networking
type: Concept

technology and social networking
type: Concept
narrower: open source networks

concepts
type: Collection
type: ConceptGroup
member: open source networks