optic ataxia
definition: In normal adults, even the most mundane interactions with the objects around us are virtuoso feats of elegance and efficiency. Much of this elegance derives from the effortless use of vision to anticipate the properties of objects and to monitor the progress of ongoing movements. [Source: Encyclopedia of Perception; Optic Ataxia]
broader: visual perception
type: Concept

concepts
type: Collection
type: ConceptGroup
member: optic ataxia

visual perception
type: Concept
narrower: optic ataxia