organizational socialization tactics
definition: Organizational socialization refers to the process whereby new employees move from being organizational outsiders to becoming functioning organizational insiders. Socialization has been called the process of learning the ropes of being an effective employee. [Source: Encyclopedia of Industrial and Organizational Psychology; Organizational Socialization Tactics]
broader: staff development, training and evaluation
type: Concept

concepts
type: Collection
type: ConceptGroup
member: organizational socialization tactics

staff development, training and evaluation
type: Concept
narrower: organizational socialization tactics