theories of ethics
type: Concept
narrower: other-regardingness

other-regardingness
definition: Other-regardingness concerns acts and virtues focused on benefiting other people rather than oneself. In its most narrow formulation, other-regardingness primarily means not harming other people (nonmaleficence). [Source: Encyclopedia of Business Ethics and Society; Other-Regardingness]
broader: theories of ethics
type: Concept

concepts
type: Collection
type: ConceptGroup
member: other-regardingness