pollution
type: Concept
narrower: ozone depletion

concepts
type: Collection
type: ConceptGroup
member: ozone depletion

ozone depletion
definition: Ozone is a relatively unstable form of molecular oxygen containing three oxygen atoms (03). Ozone near the earth's surface is the most noxious component of smog that is treated as an air pollutant in most industrial countries. [Source: Encyclopedia of Business Ethics and Society; Ozone Depletion]
broader: pollution
type: Concept