decisions and game theory
type: Concept
narrower: p-power

p-power
definition: P-power is the notion of voting power as a voter's expected relative share, under a given decision rule, in a constant sum of transferable utility (or prize) to be distributed among the voters. This is contrasted with I-power. [Source: Encyclopedia of Power; P-Power]
broader: decisions and game theory
type: Concept

concepts
type: Collection
type: ConceptGroup
member: p-power