p value
definition: The p value for a statistical test of a hypothesis is defined as the probability, calculated under assumption the that the null hypothesis is true, of obtaining a sample result as extreme as, or more extreme than, that observed in a particular direction. This direction is determined by the direction of the one-tailed (or onesided) alternative. [Source: The SAGE Encyclopedia of Social Science Research Methods; P Value]
broader: statistics and research methods
type: Concept

methods
type: Collection
type: ConceptGroup
member: p value

statistics and research methods
type: Concept
narrower: p value