concepts
type: Collection
type: ConceptGroup
member: pacifism and conscientious objection

pacifism and conscientious objection
definition: Pacifism is the belief that humanity can live peaceably whilst rejecting warfare as a means of settling disputes. It is the belief that violence is morally wrong, and that conflicting interests can be mediated through exclusively nonviolent means. [Source: The Encyclopedia of Political Science; Pacifism and Conscientious Objection]
broader: war, peace and terrorism
type: Concept

war, peace and terrorism
type: Concept
narrower: pacifism and conscientious objection