medicine and psychology
type: Concept
narrower: pandemic planning

pandemic planning
definition: A pandemic is a large international epidemic of an infectious disease. The status of an outbreak as a pandemic depends more on its geographical extent and the number of people infected than it does on the lethality of the pathogen. [Source: Encyclopedia of Disaster Relief; Pandemic Planning]
broader: medicine and psychology
type: Concept

concepts
type: Collection
type: ConceptGroup
member: pandemic planning