parametric survival analysis
definition: Parametric survival analysis is a subset of mathematical and statistical methods for characterizing the time relatedness of the occurrence of events such as death. It is distinguished from nonparametric and semiparametric methods by using a mathematical formula, termed a model, to summarize times to an event. [Source: Encyclopedia of Medical Decision Making; Parametric Survival Analysis]
broader: biostatistics and clinical epidemiology
type: Concept

biostatistics and clinical epidemiology
type: Concept
narrower: parametric survival analysis

methods
type: Collection
type: ConceptGroup
member: parametric survival analysis