paramilitary policing
definition: DefinitionParamilitary policing is a controversial topic. A simple or traditional definition refers to military-style enforcement by armed state or non-state groups. [Source: The SAGE Dictionary of Policing; Paramilitary Policing]
broader: policing
type: Concept

policing
type: Concept
narrower: paramilitary policing

concepts
type: Collection
type: ConceptGroup
member: paramilitary policing