participant-observation
definition: Often described as immersion in a culture, participant-observation is the principal methodological component of ethnographic fieldwork. The researcher watches people and their activities in the social situation under study, gradually increasing participation in the culture as a check on observations. [Source: Encyclopedia of Anthropology; Participant-Observation]
broader: research/theoretical frameworks
type: Concept

research/theoretical frameworks
type: Concept
narrower: participant-observation

methods
type: Collection
type: ConceptGroup
member: participant-observation