patron-client networks
definition: Patron-client networks are formed between individuals of unequal social status for mutual gain. Patron-client ties involve two-person, face-to-face relationships in which individuals of higher social status or political power (the patron) use their resources or power to give material benefits or provide security to individuals of lower social status or influence (clients). [Source: The Encyclopedia of Political Science; Patron-client Networks]
broader: interest groups and lobbies
type: Concept

interest groups and lobbies
type: Concept
narrower: patron-client networks

concepts
type: Collection
type: ConceptGroup
member: patron-client networks