percentiles
definition: if a set of scores is put in order from the smallest to the largest, the 10 percentile is the score which cuts off the bottom 10% of scores (the smallest scores). Similarly, the 30th percentile is the score which cuts off the bottom 30% of scores. [Source: The SAGE Dictionary of Statistics; percentiles]
broader: statistics and research methods
type: Concept

methods
type: Collection
type: ConceptGroup
member: percentiles

statistics and research methods
type: Concept
narrower: percentiles