concepts
type: Collection
type: ConceptGroup
member: perioperative issues

perioperative issues
definition: Some 50 years ago, surgery was considered to be too risky for elderly patients. Today, centenarians undergo a wide variety of surgical procedures. [Source: Encyclopedia of Health & Aging; Perioperative Issues]
broader: physical status
type: Concept

physical status
type: Concept
narrower: perioperative issues