permutation
definition: The process of changing the order of an ordered set of objects. (b. [Source: Dictionary of Statistics & Methodology; Permutation]
broader: bootstrapping
type: Concept

concepts
type: Collection
type: ConceptGroup
member: permutation

bootstrapping
type: Concept
narrower: permutation