plantations
definition: Plantations are farms covering a large land area that are usually devoted to growing a single crop that will be sold for cash. They are classified according to the manner in which they employ laborers, or according to the kind of crop that is grown. [Source: Encyclopedia of Environment and Society; Plantation]
broader: agriculture
type: Concept

agriculture
type: Concept
narrower: plantations

concepts
type: Collection
type: ConceptGroup
member: plantations