international law enforcement
type: Concept
narrower: police training: a comparative perspective

concepts
type: Collection
type: ConceptGroup
member: police training: a comparative perspective

police training: a comparative perspective
definition: In many progressive countries, including the United States, training is an ongoing and constantly evolving venture; therefore, information about training curricula is constantly becoming obsolete. Nevertheless, the approaches some countries have taken to common training obstacles are worthy of consideration in comparative perspective. [Source: Encyclopedia of Law Enforcement; Police Training: A Comparative Perspective]
broader: international law enforcement
type: Concept