concepts
type: Collection
type: ConceptGroup
member: policy impacts

public policy
type: Concept
narrower: policy impacts

policy impacts
definition: The concept of policy impacts refers to the effects and consequences of public policy on individuals, groups, the broader society, and the natural world in which we live. All policies have intended targets but are more or less successful in attaining their stated goals. [Source: International Encyclopedia of Political Science; Impacts, Policy]
broader: public policy
type: Concept