the self
type: Concept
narrower: positive illusions

concepts
type: Collection
type: ConceptGroup
member: positive illusions

positive illusions
definition: Definition Positive illusions refers to a set of three related beliefs that characterize the way people think about (1) themselves, (2) their ability to control environmental events, and (3) their future. Instead of being evenhanded or balanced between the good and the bad, people are unrealistically positive: They believe they have many more positive than negative personal qualities, they exaggerate their abilities to bring about desired outcomes, and they are overly optimistic about their futures. [Source: Encyclopedia of Social Psychology; Positive Illusions]
broader: the self
type: Concept