professional development and standards
type: Concept
narrower: postdegree/prelicensure supervision

concepts
type: Collection
type: ConceptGroup
member: postdegree/prelicensure supervision

postdegree/prelicensure supervision
definition: Counselors have been eligible for licensing beginning in 1973 in Virginia. Currently, all states with the exception of Nevada and California have licensing, and there is considerable variability as to required credits, course titles and topics, and pre- and postgraduate hours of supervision. [Source: Encyclopedia of Counseling; Postdegree/Prelicensure Supervision]
broader: professional development and standards
type: Concept