finance ethics
type: Concept
narrower: predatory pricing and trading

concepts
type: Collection
type: ConceptGroup
member: predatory pricing and trading

predatory pricing and trading
definition: Predatory pricing is an anticompetitive measure employed by a dominant company to protect market share from new or existing competitors. It generally involves temporarily pricing a product low enough to end a competitive threat. [Source: Encyclopedia of Business Ethics and Society; Predatory Pricing and Trading]
broader: finance ethics
type: Concept