prison programs
type: Concept
narrower: prerelease programs

concepts
type: Collection
type: ConceptGroup
member: prerelease programs

prerelease programs
definition: Prerelease programs help men and women prepare for life after prison. Former prisoners face many challenges upon reentry into community life, such as finding employment, reestablishing family relationships, resisting drug use and criminal behavior, and addressing mental and physical health problems. [Source: Encyclopedia of Prisons & Correctional Facilities; Prerelease Programs]
broader: prison programs
type: Concept