educational administration
type: Concept
narrower: principalship

concepts
type: Collection
type: ConceptGroup
member: principalship

principalship
definition: Principals are midlevel managers responsible for the efficient and effective functioning of the building and the occupants in it. They serve as a vital connecting link between central office/board of education and classrooms and between teachers and parents. [Source: Encyclopedia of Educational Leadership and Administration; Principalship]
broader: educational administration
type: Concept