principle of universalizability
definition: The principle of universalizability is a form of a moral test that invites us to imagine a world in which any proposed action is also adopted by everyone else. Most notably, it is the foundational principle for deontological, or duty-based, ethics. [Source: Encyclopedia of Business Ethics and Society; Universalizability, Principle of]
broader: theories of ethics
type: Concept

theories of ethics
type: Concept
narrower: principle of universalizability

concepts
type: Collection
type: ConceptGroup
member: principle of universalizability