organizations, schools, and projects
type: Concept
narrower: professors of curriculum

concepts
type: Collection
type: ConceptGroup
member: professors of curriculum

professors of curriculum
definition: The organization known as the Professors of Curriculum (POC) had its beginnings in 1944 when Hollis Caswell of Teachers College, Columbia University, invited a group of colleagues to meet informally to discuss their work. They began their meetings close to the time that the Association for Supervision and Curriculum Development (ASCD) was formed and began meeting formally at the annual ASCD Conferences in 1945. [Source: Encyclopedia of Curriculum Studies; Professors of Curriculum]
broader: organizations, schools, and projects
type: Concept