program evaluation and auditing
definition: The structure of policy making is a continuous multistage process during which programs or policies are designed, implemented, evaluated, and modified. Program evaluations are the part of the process focused on determining whether intended objectives have been met. [Source: The Encyclopedia of Political Science; Program Evaluation and Auditing]
broader: public policy
type: Concept

concepts
type: Collection
type: ConceptGroup
member: program evaluation and auditing

public policy
type: Concept
narrower: program evaluation and auditing