parenting
type: Concept
narrower: programs in parent involvement

programs in parent involvement
definition: Parent involvement refers to activities, programs, or services that involve parents in the care, development, and education of their children. Early parent involvement programs focus on helping parents provide appropriate stimulation for infants and toddlers. [Source: Encyclopedia of Applied Developmental Science; Parent Involvement, Programs in]
broader: parenting
type: Concept

concepts
type: Collection
type: ConceptGroup
member: programs in parent involvement