public-private interactions in mitigation
definition: In the context of disasters, the term mitigation refers to the broad range of efforts aimed to minimize in advance the potential destructive consequences that may be caused by a disaster. Appropriate mitigation should save human lives, property, and infrastructure. [Source: Encyclopedia of Disaster Relief; Public-Private Interactions in Mitigation]
broader: disaster mitigation
type: Concept

concepts
type: Collection
type: ConceptGroup
member: public-private interactions in mitigation

disaster mitigation
type: Concept
narrower: public-private interactions in mitigation