qualitative spatial relations
definition: Geographical information systems (GIS) typically contain many gigabytes of quantitative spatial data; a major problem is how to best query and abstract this data for presentation to the human user. One possibility is through the use of maps and other graphical interfaces. [Source: Encyclopedia of Geographic Information Science; Spatial Relations, Qualitative]
broader: conceptual foundations of GIS
type: Concept

methods
type: Collection
type: ConceptGroup
member: qualitative spatial relations

conceptual foundations of GIS
type: Concept
narrower: qualitative spatial relations