quality indicators
definition: Healthcare quality indicators are tools to measure and monitor the quality of care. Quality indicators are used to determine how well a healthcare system is performing and how it can be further improved. [Source: Encyclopedia of Health Services Research; Quality Indicators]
broader: quality and safety of care
type: Concept

concepts
type: Collection
type: ConceptGroup
member: quality indicators

quality and safety of care
type: Concept
narrower: quality indicators