quality of democracy
definition: In recent decades, discontent, dissatisfaction, and alienation have been growing political phenomena in old, established democracies. At the same time, more and more countries have been defined as democratic. [Source: International Encyclopedia of Political Science; Democracy, Quality]
broader: democracy and democratization
type: Concept

concepts
type: Collection
type: ConceptGroup
member: quality of democracy

democracy and democratization
type: Concept
narrower: quality of democracy