quantitative research on education
definition: When sociology was being shaped as a discipline, education promptly emerged as an important component of the field. Studying the role of education in sociology in a quantitative manner has seen many changes and developments over the last two centuries. [Source: Sociology of Education: An A-to-Z Guide; Quantitative Research on Education]
broader: educational research related topics
type: Concept

educational research related topics
type: Concept
narrower: quantitative research on education

concepts
type: Collection
type: ConceptGroup
member: quantitative research on education