management techniques
type: Concept
narrower: queuing theory

concepts
type: Collection
type: ConceptGroup
member: queuing theory

queuing theory
definition: The mathematical study of waiting lines or queues. It is used most widely in economics and business and can be applied to any waiting line from customers at checkout counters to aircraft on runways. [Source: Dictionary of Statistics & Methodology; Queuing Theory]
broader: management techniques
type: Concept