concepts
type: Collection
type: ConceptGroup
member: radical democracy

radical democracy
definition: Political theorists have used the term radical democracy in different ways. In general, the “radical” of radical democracy refers to a wish to address, and change, the fundamentals of democracy. [Source: Encyclopedia of Political Theory; Radical Democracy]
broader: democratic thought
type: Concept

democratic thought
type: Concept
narrower: radical democracy