rape myths
definition: The stereotype of rape is that it is a violent attack by a stranger, leaving the victim—who fought back—injured. Most rapes do not fit this pattern; generally victims/survivors know their assailants. [Source: Encyclopedia of Victimology and Crime Prevention; Rape Myths]
broader: victimology
type: Concept

victimology
type: Concept
narrower: rape myths

concepts
type: Collection
type: ConceptGroup
member: rape myths