rational models of budgeting
definition: Budgeting refers to decisions about how much funding to provide for the programs, staffs, and infrastructures of government, as well as about the processes used to arrive at funding levels. In examining processes, budgeting theories explain how individuals who hold budget-writing positions choose funding levels for programs. [Source: International Encyclopedia of Political Science; Budgeting, Rational Models]
broader: public administration
type: Concept

public administration
type: Concept
narrower: rational models of budgeting

concepts
type: Collection
type: ConceptGroup
member: rational models of budgeting