theories of ethics
type: Concept
narrower: rationality and ethics

rationality and ethics
definition: The word logos was used in Greek philosophy to refer to rationality. Logos was adopted by the Romans as ratio, which became rationality in English. [Source: Encyclopedia of Business Ethics and Society; Rationality and Ethics]
broader: theories of ethics
type: Concept

concepts
type: Collection
type: ConceptGroup
member: rationality and ethics